Target
Tyrosine-protein kinase ABL1 [64-515]
Ligand
BDBM213650
Substrate
Meas. Tech.
Radio ABL1 (64-515) Assay
pH
7.5±n/a
Temperature
298.15±n/a K
IC50
6±n/a nM
Comments
extracted
Citation
 Furet, PGrotzfeld, RMJahnke, WJones, DBManley, PWMarzinzik, APelle, XFSalem, BSchoepfer, JSpieser, EA Compounds and compositions for inhibiting the activity of ABL1, ABL2 and BCR-ABL1 US Patent  US9278981 Publication Date 3/8/2016 
Target
Name:
Tyrosine-protein kinase ABL1 [64-515]
Synonyms:
ABL ABL1_HUMAN Tyrosine-protein kinase ABL1 Tyrosine-protein kinase ABL1 (ABL) | Tyrosine-protein kinase ABL1 (ABL1)
Type:
Enzyme Catalytic Domain
Mol. Mass.:
51539.77
Organism:
Homo sapiens (Human)
Description:
aa 64-515
Residue:
452
  
Inhibitor
Name:
BDBM213650
Synonyms:
US9278981, 242
Type:
Small organic molecule
Emp. Form.:
C22H17F5N4O3
Mol. Mass.:
480.3874
SMILES:
O[C@@H]1CCN(C1)c1ncc(cc1-c1cc(F)nc(F)c1)C(=O)Nc1ccc(OC(F)(F)F)cc1
: