Target
Cadherin-1 [819-873]/Catenin beta-1 [138-686]
Ligand
BDBM213761
Substrate
Meas. Tech.
AlphaScreen Assay
pH
7.4±n/a
Temperature
298.15±n/a K
Ki
105350±2250 nM
Comments
extracted
Citation
 Ji, HYu, BZhang, MGuo, W Substituted 1H-indazol-1-ol analogs as inhibitors of beta catenin/Tcf protein-protein interactions US Patent  US9284299 Publication Date 3/15/2016 
Target
Name:
Cadherin-1 [819-873]/Catenin beta-1 [138-686]
Synonyms:
Beta-catenin/E-cadherin
Type:
Enzyme
Mol. Mass.:
Description:
Components:
This complex has 2 components.
Component 1
Name:
Catenin beta-1 [138-686]
Synonyms:
Beta-catenin CTNNB | CTNNB1
Type:
Protein
Mol. Mass.:
60127.24
Organism:
Homo sapiens (Human)
Description:
aa 138-686
Residue:
549
  
Component 2
Name:
Cadherin-1 [819-873]
Synonyms:
CADH1_HUMAN CDHE UVO
Type:
Enzyme
Mol. Mass.:
6102.29
Organism:
Homo sapiens (Human)
Description:
Human E-cadherin truncation (819-873 aa)
Residue:
55
  
Inhibitor
Name:
BDBM213761
Synonyms:
US9284299, 12 | US9738628, Compound 12
Type:
Small organic molecule
Emp. Form.:
C9H9N7O
Mol. Mass.:
231.2141
SMILES:
On1nnc2cc(CCc3nn[nH]n3)ccc12
: