Target
Cadherin-1 [819-873]/Catenin beta-1 [138-686]
Ligand
BDBM32102
Substrate
Meas. Tech.
Fluorescence Polarization (FP) Assay
Temperature
298.15±n/a K
Ki
13300±110 nM
Comments
extracted
Citation
 Ji, HYu, BZhang, MGuo, W Substituted 1H-indazol-1-ol analogs as inhibitors of beta catenin/Tcf protein-protein interactions US Patent  US9284299 Publication Date 3/15/2016 
Target
Name:
Cadherin-1 [819-873]/Catenin beta-1 [138-686]
Synonyms:
Beta-catenin/E-cadherin
Type:
Enzyme
Mol. Mass.:
Description:
Components:
This complex has 2 components.
Component 1
Name:
Catenin beta-1 [138-686]
Synonyms:
Beta-catenin CTNNB | CTNNB1
Type:
Protein
Mol. Mass.:
60127.24
Organism:
Homo sapiens (Human)
Description:
aa 138-686
Residue:
549
  
Component 2
Name:
Cadherin-1 [819-873]
Synonyms:
CADH1_HUMAN CDHE UVO
Type:
Enzyme
Mol. Mass.:
6102.29
Organism:
Homo sapiens (Human)
Description:
Human E-cadherin truncation (819-873 aa)
Residue:
55
  
Inhibitor
Name:
BDBM32102
Synonyms:
1,6-dimethylpyrimido[5,4-e][1,2,4]triazine-5,7(1H,6H)-dione 1,6-dimethylpyrimido[5,4-e][1,2,4]triazine-5,7-quinone SMR000024051 US9738628, Compound PKF118-310 | cid_66541
Type:
Small organic molecule
Emp. Form.:
C7H7N5O2
Mol. Mass.:
193.1628
SMILES:
Cn1ncnc2c1nc(=O)n(C)c2=O
: