Target
Dipeptidyl peptidase 9 [Y305D]
Ligand
BDBM213827
Substrate
Meas. Tech.
Kinetics Assays
Temperature
277.15±n/a K
Ki
4.00e+4±n/a nM
Comments
extracted
Citation
 Pilla, EKilisch, MLenz, CUrlaub, HGeiss-Friedlander, R The SUMO1-E67 interacting loop peptide is an allosteric inhibitor of the dipeptidyl peptidases 8 and 9. J Biol Chem 288:32787-96 (2013)  
Target
Name:
Dipeptidyl peptidase 9 [Y305D]
Synonyms:
DPP9 DPRP2 | Dipeptidyl peptidase 9 (DDP9 Y305D)
Type:
Enzyme
Mol. Mass.:
98211.61
Organism:
Homo sapiens (Human)
Description:
Human DDP9 Y305D mutant
Residue:
863
  
Inhibitor
Name:
BDBM213827
Synonyms:
E67 interacting loop (EIL) | SLRFLFEGQRIADNH
Type:
Small organic molecule
Emp. Form.:
C80H123N25O23
Mol. Mass.:
1802.9863
SMILES:
CC[C@H](C)[C@H](NC(=O)[C@H](CCCNC(N)=N)NC(=O)[C@H](CCC(N)=O)NC(=O)CNC(=O)[C@H](CCC(O)=O)NC(=O)[C@H](Cc1ccccc1)NC(=O)[C@H](CC(C)C)NC(=O)[C@H](Cc1ccccc1)NC(=O)[C@H](CCCNC(N)=N)NC(=O)[C@H](CC(C)C)NC(=O)[C@@H](N)CO)C(=O)N[C@@H](C)C(=O)N[C@@H](CC(O)=O)C(=O)N[C@@H](CC(N)=O)C(=O)N[C@@H](Cc1cnc[nH]1)C(O)=O
: