Target
Isoform Tau-F of Microtubule-associated protein tau
Ligand
BDBM214759
Substrate
Meas. Tech.
Tau Protein Assay
pH
7.4±n/a
IC50
3.29e+3±n/a nM
Comments
extracted
Citation
 Schafer, KNCisek, KHuseby, CJChang, EKuret, J Structural determinants of Tau aggregation inhibitor potency. J Biol Chem 288:32599-611 (2013)  
Target
Name:
Isoform Tau-F of Microtubule-associated protein tau
Synonyms:
MAPT MTBT1 Microtubule-associated protein Tau isoform 2N4R (Tau 2N4R) TAU | TAU_HUMAN
Type:
Enzyme Catalytic Domain
Mol. Mass.:
45857.42
Organism:
Homo sapiens (Human)
Description:
P10636-8
Residue:
441
  
Inhibitor
Name:
BDBM214759
Synonyms:
Rhodanines, 47A
Type:
Small organic molecule
Emp. Form.:
C18H15ClN2O4S
Mol. Mass.:
390.841
SMILES:
CCOC(=O)CN1C(=S)N\C(=C/c2ccc(o2)-c2cccc(Cl)c2)C1=O
: