Target
Cannabinoid receptor 1 [R340A]
Ligand
BDBM21278
Substrate
Meas. Tech.
Radioligand Binding Assay
pH
7.4±n/a
Kd
2.4±0.8 nM
Comments
extracted
Citation
 Shim, JYAhn, KHKendall, DA Molecular basis of cannabinoid CB1 receptor coupling to the G protein heterotrimer Gaiß¿: identification of key CB1 contacts with the C-terminal helix a5 of Gai. J Biol Chem 288:32449-65 (2013)  
Target
Name:
Cannabinoid receptor 1 [R340A]
Synonyms:
CNR CNR1_HUMAN | Cannabinoid receptor 1 (CB1 R340A)
Type:
Protein
Mol. Mass.:
52782.85
Organism:
Homo sapiens (Human)
Description:
Human CB1 R340A mutant
Residue:
472
  
Inhibitor
Name:
BDBM21278
Synonyms:
5-(4-chlorophenyl)-1-(2,4-dichlorophenyl)-4-methyl-N-(piperidin-1-yl)-1H-pyrazole-3-carboxamide CHEMBL111 RIMONABANT HYDROCHLORIDE SR 141716A SR141716A [3H]SR141716A
Type:
Small organic molecule
Emp. Form.:
C22H21Cl3N4O
Mol. Mass.:
463.787
SMILES:
Cc1c(nn(c1-c1ccc(Cl)cc1)-c1ccc(Cl)cc1Cl)C(=O)NN1CCCCC1
: