Target
Poly [ADP-ribose] polymerase 1
Ligand
BDBM50387933
Substrate
Meas. Tech.
PARP Enzyme Inhibition Assay
pH
8±n/a
Ki
6±n/a nM
Comments
extracted
Citation
 Gandhi, VBGiranda, VLGong, JPenning, TDZhu, G Inhibitors of poly(ADP-ribose)polymerase US Patent  US9283222 Publication Date 3/15/2016 
Target
Name:
Poly [ADP-ribose] polymerase 1
Synonyms:
(ARTD1 or PARP1) 2.4.2.30 ADPRT ARTD1 Human diphtheria toxin-like ADP-ribosyltransferase (ARTD1 or PARP1) NT-PARP-1 PARP1 PPOL Poly [ADP-ribose] polymerase 1 (PARP) Poly [ADP-ribose] polymerase 1 (PARP1) Poly [ADP-ribose] polymerase 1, 28-kDa form Poly [ADP-ribose] polymerase 1, processed C-terminus Poly [ADP-ribose] polymerase-1 Poly(ADP-ribose) polymerase-1 (ARTD1/PARP1) Protein poly-ADP-ribosyltransferase PARP1 | Synonyms=ADPRT
Type:
Mol. Mass.:
113114.22
Organism:
Homo sapiens (Human)
Description:
P09874
Residue:
1014
  
Inhibitor
Name:
BDBM50387933
Synonyms:
CHEMBL2058914 | US9283222, 516
Type:
Small organic molecule
Emp. Form.:
C20H24FN5O2
Mol. Mass.:
385.4353
SMILES:
CN1CCN(CC1)C(=O)c1cc(Cc2n[nH]c(=O)c3CCCNc23)ccc1F
: