Target
Cellular tumor antigen p53 [1-83]/E3 ubiquitin-protein ligase Mdm2 [1-188]
Ligand
BDBM50448947
Substrate
Meas. Tech.
Homogenous Time-Resolved Fluorescence Assay (HTRF2 Assay)
pH
7.4±n/a
Temperature
298.15±n/a K
IC50
1±n/a nM
Comments
extracted
Citation
Target
Name:
Cellular tumor antigen p53 [1-83]/E3 ubiquitin-protein ligase Mdm2 [1-188]
Synonyms:
MDM2 and p53 | mdm2
Type:
Enzyme
Mol. Mass.:
Description:
Components:
This complex has 2 components.
Component 1
Name:
E3 ubiquitin-protein ligase Mdm2 [1-188]
Synonyms:
E3 ubiquitin-protein ligase Mdm2 (aa 1-188) MDM2_HUMAN
Type:
Mol. Mass.:
21319.18
Organism:
Homo sapiens (Human)
Description:
Q00987[1-188]
Residue:
188
  
Component 2
Name:
Cellular tumor antigen p53 [1-83]
Synonyms:
P53 TP53 | Tumor suppressor p53
Type:
Enzyme
Mol. Mass.:
8975.74
Organism:
Homo sapiens (Human)
Description:
Residues 1-83
Residue:
83
  
Inhibitor
Name:
BDBM50448947
Synonyms:
CHEMBL3125702 US9593129, Example 362
Type:
Small organic molecule
Emp. Form.:
C28H35Cl2NO5S
Mol. Mass.:
568.552
SMILES:
CC(C)[C@@H](CS(=O)(=O)C(C)C)N1[C@@H]([C@H](C[C@](C)(CC(O)=O)C1=O)c1cccc(Cl)c1)c1ccc(Cl)cc1
: