Target
Diacylglycerol O-acyltransferase 2
Ligand
BDBM215582
Substrate
Meas. Tech.
In Vitro DGAT2 Assay
pH
7.4±n/a
Temperature
298.15±n/a K
IC50
62.3±n/a nM
Comments
extracted
Citation
 Ahn, KBoehm, MCabral, SCarpino, PAFutatsugi, KHepworth, DKung, DWOrr, SWang, J Diacylglycerol acyltransferase 2 inhibitors US Patent  US9296745 Publication Date 3/29/2016 
Target
Name:
Diacylglycerol O-acyltransferase 2
Synonyms:
ARAT DGAT2 Diacylglycerol O-acyltransferase 2 (DGAT2) Retinol O-fatty-acyltransferase
Type:
Multi-pass membrane protein
Mol. Mass.:
43848.90
Organism:
Homo sapiens (Human)
Description:
Q96PD7
Residue:
388
  
Inhibitor
Name:
BDBM215582
Synonyms:
US9296745, 139
Type:
Small organic molecule
Emp. Form.:
C24H28N6O2
Mol. Mass.:
432.5181
SMILES:
OC1(CC1)c1cccc(n1)-c1nc2ccc(nc2[nH]1)N1CCC[C@H](C1)C(=O)N1CCCC1
: