Target
Sodium channel protein type 9 subunit alpha
Ligand
BDBM217955
Substrate
Meas. Tech.
Nav1.7 In Vitro PX Assay
IC50
1484±n/a nM
Citation
 Weiss, MBoezio, ABoezio, CButler, JRChu-Moyer, MYDimauro, EFDineen, TGraceffa, RGuzman-Perez, AHuang, HKreiman, CLa, DMarx, IEMilgrim, BCNguyen, HNPeterson, ERomero, KSparling, B Bicyclic sulfonamide compounds as sodium channel inhibitors US Patent  US9212182 Publication Date 12/15/2015 
Target
Name:
Sodium channel protein type 9 subunit alpha
Synonyms:
NENA Peripheral sodium channel 1 SCN9A_HUMAN Voltage-gated sodium channel subunit Nav1.7 hNE-Na
Type:
Protein
Mol. Mass.:
226375.97
Organism:
Homo sapiens (Human)
Description:
Q15858
Residue:
1988
  
Inhibitor
Name:
BDBM217955
Synonyms:
US9212182, 1118
Type:
Small organic molecule
Emp. Form.:
C25H24FN3O6S
Mol. Mass.:
513.538
SMILES:
COc1cc(C[C@H]2CCCOC2)c(F)cc1-n1c2ccc(cc2ccc1=O)S(=O)(=O)Nc1ccon1
: