Target
Metabotropic glutamate receptor 2
Ligand
BDBM160743
Substrate
Meas. Tech.
MGluR2 cAMP Assay
pH
7±n/a
EC50
2.00±n/a nM
Comments
extracted
Citation
 Mattson, RJMeng, ZGuernon, LR Positive allosteric modulators of mGluR2 US Patent  US9682980 Publication Date 6/20/2017 
Target
Name:
Metabotropic glutamate receptor 2
Synonyms:
GPRC1B GRM2_HUMAN Metabotropic glutamate receptor mGlu2 | metabotropic glutamate 2
Type:
Enzyme
Mol. Mass.:
95584.88
Organism:
Homo sapiens (Human)
Description:
Q14416
Residue:
872
  
Inhibitor
Name:
BDBM160743
Synonyms:
US9682980, 8-Chloro-7-(4-(2-fluoro-6-methoxyphenyl)piperidin-1-yl)-3-(2,2,2-trifluoroethyl)-[1,2,4]triazolo[4,3-b]pyridazine
Type:
Small organic molecule
Emp. Form.:
C19H18ClF4N5O
Mol. Mass.:
443.826
SMILES:
COc1cccc(F)c1C1CCN(CC1)c1cnn2c(CC(F)(F)F)nnc2c1Cl
: