Target
Isoform 2 of Nuclear receptor ROR-gamma (RORgT)
Ligand
BDBM50058844
Substrate
Meas. Tech.
ThermoFluor® Assay
pH
7±n/a
Temperature
274.15±n/a K
Kd
18±n/a nM
Comments
extracted
Citation
 Leonard, KABarbay, KEdwards, JPKreutter, KDKummer, DAMaharoof, UNishimura, RUrbanski, MVenkatesan, HWang, AWolin, RLWoods, CRPierce, JGoldberg, SFourie, AXue, X Methylene linked quinolinyl modulators of RORγt US Patent  US9290476 Publication Date 3/22/2016 
Target
Name:
Isoform 2 of Nuclear receptor ROR-gamma (RORgT)
Synonyms:
Isoform 2 of Nuclear receptor ROR-gamma Nuclear receptor ROR-gamma (RORgT) RORC RORG_HUMAN Retinoid-related orphan receptor-gamma (RORgT) | Retinoid-related orphan receptor-gamma (RORĪ³T)
Type:
Protein
Mol. Mass.:
55831.73
Organism:
Homo sapiens (Human)
Description:
P51449-2
Residue:
497
  
Inhibitor
Name:
BDBM50058844
Synonyms:
CHEMBL3325741 | US9290476, 1
Type:
Small organic molecule
Emp. Form.:
C27H20Cl3N3O
Mol. Mass.:
508.826
SMILES:
Cn1cncc1C(O)(c1ccc(Cl)cc1)c1ccc2nc(Cl)c(Cc3ccccc3)c(Cl)c2c1
: