Target
Isoform 2 of Nuclear receptor ROR-gamma (RORgT)
Ligand
BDBM220169
Substrate
Meas. Tech.
ThermoFluor® Assay
pH
7±n/a
Temperature
274.15±n/a K
Kd
16±n/a nM
Comments
extracted
Citation
 Leonard, KABarbay, KEdwards, JPKreutter, KDKummer, DAMaharoof, UNishimura, RUrbanski, MVenkatesan, HWang, AWolin, RLWoods, CRPierce, JGoldberg, SFourie, AXue, X Methylene linked quinolinyl modulators of RORγt US Patent  US9290476 Publication Date 3/22/2016 
Target
Name:
Isoform 2 of Nuclear receptor ROR-gamma (RORgT)
Synonyms:
Isoform 2 of Nuclear receptor ROR-gamma Nuclear receptor ROR-gamma (RORgT) RORC RORG_HUMAN Retinoid-related orphan receptor-gamma (RORgT) | Retinoid-related orphan receptor-gamma (RORĪ³T)
Type:
Protein
Mol. Mass.:
55831.73
Organism:
Homo sapiens (Human)
Description:
P51449-2
Residue:
497
  
Inhibitor
Name:
BDBM220169
Synonyms:
US9290476, 12
Type:
Small organic molecule
Emp. Form.:
C28H22Cl3N3O2
Mol. Mass.:
538.852
SMILES:
COc1ccc(Cc2c(Cl)nc3ccc(cc3c2Cl)C(O)(c2cncn2C)c2ccc(Cl)cc2)cc1
: