Target
Isoform 2 of Nuclear receptor ROR-gamma (RORgT)
Ligand
BDBM220177
Substrate
Meas. Tech.
ThermoFluor® Assay
pH
7±n/a
Temperature
274.15±n/a K
Kd
3.8±n/a nM
Comments
extracted
Citation
 Leonard, KABarbay, KEdwards, JPKreutter, KDKummer, DAMaharoof, UNishimura, RUrbanski, MVenkatesan, HWang, AWolin, RLWoods, CRPierce, JGoldberg, SFourie, AXue, X Methylene linked quinolinyl modulators of RORγt US Patent  US9290476 Publication Date 3/22/2016 
Target
Name:
Isoform 2 of Nuclear receptor ROR-gamma (RORgT)
Synonyms:
Isoform 2 of Nuclear receptor ROR-gamma Nuclear receptor ROR-gamma (RORgT) RORC RORG_HUMAN Retinoid-related orphan receptor-gamma (RORgT) | Retinoid-related orphan receptor-gamma (RORĪ³T)
Type:
Protein
Mol. Mass.:
55831.73
Organism:
Homo sapiens (Human)
Description:
P51449-2
Residue:
497
  
Inhibitor
Name:
BDBM220177
Synonyms:
US9290476, 20A | US9290476, 20B
Type:
Small organic molecule
Emp. Form.:
C30H24ClN5O3S
Mol. Mass.:
570.061
SMILES:
COc1ccc(cn1)C(O)(c1cncs1)c1ccc2nc(OC)c(Cc3ccc(cc3)-n3cccn3)c(Cl)c2c1
: