Target
Isoform 2 of Nuclear receptor ROR-gamma (RORgT)
Ligand
BDBM220190
Substrate
Meas. Tech.
ThermoFluor® Assay
pH
7±n/a
Temperature
274.15±n/a K
Kd
810±n/a nM
Comments
extracted
Citation
 Leonard, KABarbay, KEdwards, JPKreutter, KDKummer, DAMaharoof, UNishimura, RUrbanski, MVenkatesan, HWang, AWolin, RLWoods, CRPierce, JGoldberg, SFourie, AXue, X Methylene linked quinolinyl modulators of RORγt US Patent  US9290476 Publication Date 3/22/2016 
Target
Name:
Isoform 2 of Nuclear receptor ROR-gamma (RORgT)
Synonyms:
Isoform 2 of Nuclear receptor ROR-gamma Nuclear receptor ROR-gamma (RORgT) RORC RORG_HUMAN Retinoid-related orphan receptor-gamma (RORgT) | Retinoid-related orphan receptor-gamma (RORĪ³T)
Type:
Protein
Mol. Mass.:
55831.73
Organism:
Homo sapiens (Human)
Description:
P51449-2
Residue:
497
  
Inhibitor
Name:
BDBM220190
Synonyms:
US9290476, 33A US9290476, 33C
Type:
Small organic molecule
Emp. Form.:
C31H25Cl2N5O2
Mol. Mass.:
570.469
SMILES:
COc1nc2ccc(cc2c(Cl)c1Cc1ccc(cc1)-n1cccn1)C(O)(c1cncn1C)c1ccc(Cl)cc1
: