Target
Kappa-type opioid receptor
Ligand
BDBM220356
Substrate
Meas. Tech.
In Vitro Kappa-Opioid Receptor Binding Assay
pH
7.4±n/a
Temperature
298.15±n/a K
Ki
323±30 nM
Comments
extracted
Citation
 Tafesse, LTsuno, NZhou, X Azetidine-substituted quinoxalines as opioid receptor like-1 modulators US Patent  US9290488 Publication Date 3/22/2016 
Target
Name:
Kappa-type opioid receptor
Synonyms:
K-OR-1 Kappa-opioid receptor (KOR) Kappa-type opioid receptor (KOR) OPIATE Kappa OPRK1 kappa opioid receptor (KOR)
Type:
G Protein-Coupled Receptor (GPCR)
Mol. Mass.:
42648.76
Organism:
Homo sapiens (Human)
Description:
P41145
Residue:
380
  
Inhibitor
Name:
BDBM220356
Synonyms:
US9290488, A11a(i)
Type:
Small organic molecule
Emp. Form.:
C29H38N4O3
Mol. Mass.:
490.637
SMILES:
C[C@H]1C[C@H]2C[C@@H](C1)C[C@@H](C2)N1[C@H]2CC[C@@H]1C[C@@H](C2)n1c2ccccc2nc(N2CC[C@@H]2C(O)=O)c1=O
: