Target
Delta-type opioid receptor
Ligand
BDBM220356
Substrate
Meas. Tech.
In Vitro Delta-Opioid Receptor Binding Assay
pH
7.4±n/a
Temperature
298.15±n/a K
Ki
3050±110 nM
Comments
extracted
Citation
 Tafesse, LTsuno, NZhou, X Azetidine-substituted quinoxalines as opioid receptor like-1 modulators US Patent  US9290488 Publication Date 3/22/2016 
Target
Name:
Delta-type opioid receptor
Synonyms:
D-OR-1 Delta opioid receptor OPIATE Delta OPRD1 OPRK1 | opioid receptor, delta 1
Type:
G Protein-Coupled Receptor (GPCR)
Mol. Mass.:
40382.98
Organism:
Homo sapiens (Human)
Description:
Competition binding assays were carried out using membrane preparations from transfected HN9.10 cells that constitutively expressed the delta opioid receptor.
Residue:
372
  
Inhibitor
Name:
BDBM220356
Synonyms:
US9290488, A11a(i)
Type:
Small organic molecule
Emp. Form.:
C29H38N4O3
Mol. Mass.:
490.637
SMILES:
C[C@H]1C[C@H]2C[C@@H](C1)C[C@@H](C2)N1[C@H]2CC[C@@H]1C[C@@H](C2)n1c2ccccc2nc(N2CC[C@@H]2C(O)=O)c1=O
: