Target
Metabotropic glutamate receptor 2
Ligand
BDBM290574
Substrate
Meas. Tech.
mGlu Receptor In Vitro Assays
pH
7.3±n/a
Temperature
298.15±n/a K
EC50
>30000±n/a nM
Comments
extracted
Citation
 Dhanya, RPSheffler, DJCosford, NDDahl, R Metabotropic glutamate receptor positive allosteric modulators (PAMS) and uses thereof US Patent  US10099993 Publication Date 10/16/2018 
Target
Name:
Metabotropic glutamate receptor 2
Synonyms:
GPRC1B GRM2_HUMAN Metabotropic glutamate receptor mGlu2 | metabotropic glutamate 2
Type:
Enzyme
Mol. Mass.:
95584.88
Organism:
Homo sapiens (Human)
Description:
Q14416
Residue:
872
  
Inhibitor
Name:
BDBM290574
Synonyms:
US10099993, Compound 155
Type:
Small organic molecule
Emp. Form.:
C31H34O5
Mol. Mass.:
486.5987
SMILES:
COC(=O)c1ccc(OCc2cccc(COc3ccc(C(=O)CC4CCCC4)c(C)c3C)c2)cc1
: