Target
Metabotropic glutamate receptor 3
Ligand
BDBM290574
Substrate
EC50
>30000±n/a nM
Citation
 Dhanya, RPSheffler, DJCosford, NDDahl, R Metabotropic glutamate receptor positive allosteric modulators (PAMS) and uses thereof US Patent  US10099993 Publication Date 10/16/2018 
Target
Name:
Metabotropic glutamate receptor 3
Synonyms:
GPRC1C GRM3_HUMAN metabotropic glutamate 3 metabotropic glutamate 3/1c
Type:
Enzyme Catalytic Domain
Mol. Mass.:
98889.09
Organism:
Homo sapiens (Human)
Description:
metabotropic glutamate 1c 0 HUMAN::Q14832
Residue:
879
  
Inhibitor
Name:
BDBM290574
Synonyms:
US10099993, Compound 155
Type:
Small organic molecule
Emp. Form.:
C31H34O5
Mol. Mass.:
486.5987
SMILES:
COC(=O)c1ccc(OCc2cccc(COc3ccc(C(=O)CC4CCCC4)c(C)c3C)c2)cc1
: