Target
Solute carrier family 22 member 12
Ligand
BDBM290515
Substrate
Meas. Tech.
hURAT1 Inhibition Assay
IC50
19.0±n/a nM
Citation
 Xu, ZZhang, NSun, QWu, T Condensed ring derivative, and preparation method, intermediate, pharmaceutical composition and use thereof US Patent  US10100016 Publication Date 10/16/2018 
Target
Name:
Solute carrier family 22 member 12
Synonyms:
OATL4 RST S22AC_HUMAN Solute carrier family 22 member 12 URAT1 Urate anion exchanger 1 (URAT1) | Uric Acid Transporter 1 (URAT1)
Type:
Enzyme
Mol. Mass.:
59638.65
Organism:
Homo sapiens (Human)
Description:
Q96S37
Residue:
553
  
Inhibitor
Name:
BDBM290515
Synonyms:
3-[4-(4-Cyanophenyl)isoquinolin-6-yl]-2,2-dimethyl propionic Acid | US10100016, Compound 51
Type:
Small organic molecule
Emp. Form.:
C21H18N2O2
Mol. Mass.:
330.3798
SMILES:
CC(C)(Cc1ccc2cncc(-c3ccc(cc3)C#N)c2c1)C(O)=O
: