Target
Histone deacetylase 2
Ligand
BDBM222235
Substrate
Meas. Tech.
HDAC2 Enzyme Assay
IC50
5.0e+2± 6e+1 nM
Citation
 Huong, TTDung, DTHuan, NVCuong, LVHai, PTHuong, LTKim, JKim, YGHan, SBNam, NH Novel N-hydroxybenzamides incorporating 2-oxoindoline with unexpected potent histone deacetylase inhibitory effects and antitumor cytotoxicity. Bioorg Chem 71:160-169 (2017)  
Target
Name:
Histone deacetylase 2
Synonyms:
Cereblon/Histone deacetylase 2 HDAC2 Histone deacetylase 2 (HDAC2) | Human HDAC2
Type:
Chromatin regulator; hydrolase; repressor
Mol. Mass.:
55356.54
Organism:
Homo sapiens (Human)
Description:
Q92769
Residue:
488
  
Inhibitor
Name:
BDBM222235
Synonyms:
N-Hydroxy-4-((3-(hydroxyimino)-5-methoxy-2-oxoindolin-1-yl)methyl)benzamide (6f)
Type:
Small organic molecule
Emp. Form.:
C17H15N3O5
Mol. Mass.:
341.3181
SMILES:
COc1ccc2N(Cc3ccc(cc3)C(=O)NO)C(=O)\C(=N/O)c2c1
: