Target
Carbonic anhydrase 2
Ligand
BDBM222429
Substrate
Meas. Tech.
Carbonic Anhydrase II Kinetic Assay
pH
7.4±n/a
Ki
1.81e+3±n/a nM
Comments
extracted
Citation
 Iqbal, SSaleem, MAzim, MKTaha, MSalar, UKhan, KMPerveen, SChoudhary, MI Carbohydrazones as new class of carbonic anhydrase inhibitors: Synthesis, kinetics, and ligand docking studies. Bioorg Chem 72:89-101 (2017)  
Target
Name:
Carbonic anhydrase 2
Synonyms:
CA2 Carbonic anhydrase Carbonic anhydrase II Carbonic anhydrase II (CA-II)
Type:
Enzyme Catalytic Domain
Mol. Mass.:
29115.93
Organism:
Bos taurus
Description:
Residue:
260
  
Inhibitor
Name:
BDBM222429
Synonyms:
N'',N'''-Bis[(E)-(2-nitrophenyl)methylidene]carbonic dihydrazide (2)
Type:
Small organic molecule
Emp. Form.:
C15H12N6O5
Mol. Mass.:
356.293
SMILES:
[O-][N+](=O)c1ccccc1\C=N\NC(=O)N\N=C\c1ccccc1[N+]([O-])=O
: