Target
Isoform 2 of MAP kinase-interacting serine/threonine-protein kinase 1 (MNK1a) 344D]
Ligand
BDBM223043
Substrate
Meas. Tech.
MKNK1 Kinase Assay
pH
7.5±n/a
Temperature
295.15±n/a K
IC50
2±n/a nM
Comments
extracted
Citation
 Eis, KPuehler, FZorn, LScholz, ALienau, PGnoth, MJBömer, UGünther, J Substituted imidazopyridazines US Patent  US9320737 Publication Date 4/26/2016 
Target
Name:
Isoform 2 of MAP kinase-interacting serine/threonine-protein kinase 1 (MNK1a) 344D]
Synonyms:
Isoform 2 of MAP kinase-interacting serine/threonine-protein kinase 1 (MNK1a) 344D] MAP kinase signal-integrating kinase 1 (MNK1) (T344D) MAP kinase-interacting serine/threonine-protein kinase 1 (MKNK1) (T344D) MAP kinase-interacting serine/threonine-protein kinase 1 (MNK1a) [T344D] MKNK1 MKNK1_HUMAN MNK1a
Type:
Protein
Mol. Mass.:
47416.00
Organism:
Homo sapiens (Human)
Description:
Q9BUB5-2 with T344D
Residue:
424
  
Inhibitor
Name:
BDBM223043
Synonyms:
US9320737, IV.2
Type:
Small organic molecule
Emp. Form.:
C19H20N4O4S
Mol. Mass.:
400.451
SMILES:
COc1cccc2oc(cc12)-c1cnc2ccc(OCCCS(C)(=N)=O)nn12
: