Target
Tyrosine-protein kinase ABL1
Ligand
BDBM223103
Substrate
Meas. Tech.
FRET-Based Z'-Lyte Assay
pH
7.5±n/a
Temperature
298.15±n/a K
IC50
1.32±0.013 nM
Comments
extracted
Citation
 Liu, LHussain, MLuo, JDuan, AChen, CTu, ZZhang, J Synthesis and biological evaluation of novel dasatinib analogues as potent DDR1 and DDR2 kinase inhibitors. Chem Biol Drug Des 89:420-427 (2017)  
Target
Name:
Tyrosine-protein kinase ABL1
Synonyms:
ABL ABL1_HUMAN JTK7 Proto-oncogene tyrosine-protein kinase ABL1 Tyrosine-protein kinase ABL V-abl Abelson murine leukemia viral oncogene homolog 1 p150 | tyrosine-protein kinase ABL1 isoform a
Type:
Enzyme
Mol. Mass.:
122897.30
Organism:
Homo sapiens (Human)
Description:
P00519
Residue:
1130
  
Inhibitor
Name:
BDBM223103
Synonyms:
N-(2-chloro-6-methylphenyl)-2-((6-((1-(ethylsulfonyl)pyrrolidin-3-yl)amino)-2-methylpyrimidin-4-yl)amino)thiazole-5-carboxamide (5j)
Type:
Small organic molecule
Emp. Form.:
C22H26ClN7O3S2
Mol. Mass.:
536.07
SMILES:
CCS(=O)(=O)N1CCC(C1)Nc1cc(Nc2ncc(s2)C(=O)Nc2c(C)cccc2Cl)nc(C)n1
: