Target
Ubiquitin carboxyl-terminal hydrolase 2 [258-605]
Ligand
BDBM50236238
Substrate
Meas. Tech.
Ub-AMC-Hydrolysis Assay
IC50
3.11e+4± 3.4e+3 nM
Citation
 Magiera, KTomala, MKubica, KDe Cesare, VTrost, MZieba, BJKachamakova-Trojanowska, NLes, MDubin, GHolak, TASkalniak, L Lithocholic Acid Hydroxyamide Destabilizes Cyclin D1 and Induces G0/G1 Arrest by Inhibiting Deubiquitinase USP2a. Cell Chem Biol 24:458-470 (2017)  
Target
Name:
Ubiquitin carboxyl-terminal hydrolase 2 [258-605]
Synonyms:
UBP2_HUMAN USP2 | Ubiquitin-specific peptidase 2a (USP2a)
Type:
Enzyme
Mol. Mass.:
40094.16
Organism:
Homo sapiens (Human)
Description:
Hman USP2a (258-605 aa)
Residue:
348
  
Inhibitor
Name:
BDBM50236238
Synonyms:
(3alpha,5beta)-3-hydroxycholan-24-oic acid 3alpha-hydroxy-5beta-cholanic acid 5beta-cholanic acid-3alpha-ol LCA lithocholic acid
Type:
Small organic molecule
Emp. Form.:
C24H40O3
Mol. Mass.:
376.5726
SMILES:
C[C@H](CCC(O)=O)[C@H]1CC[C@H]2[C@@H]3CC[C@@H]4C[C@H](O)CC[C@]4(C)[C@H]3CC[C@]12C
: