Target
Galectin-3
Ligand
BDBM223991
Substrate
Meas. Tech.
Fluorescence Polarization Assay
Temperature
298.15±0 K
Kd
2.99e+3± 1.7e+2 nM
Citation
 Dion, JDeshayes, FStorozhylova, NAdvedissian, TLambert, AViguier, MTellier, CDussouy, CPoirier, FGrandjean, C Lactosamine-Based Derivatives as Tools to Delineate the Biological Functions of Galectins: Application to Skin Tissue Repair. Chembiochem 18:782-789 (2017)  
Target
Name:
Galectin-3
Synonyms:
LEG3_HUMAN MAC2
Type:
Enzyme
Mol. Mass.:
26156.54
Organism:
Homo sapiens (Human)
Description:
P17931
Residue:
250
  
Inhibitor
Name:
BDBM223991
Synonyms:
[3-O-(2-naphthyl)methyl-β-D-galactopyranosyl]-(1-4)-2-deoxy-2-(3-methoxybenzamido)-β-D-glucopyranoside (11)
Type:
Small organic molecule
Emp. Form.:
C34H41N3O12
Mol. Mass.:
683.7022
SMILES:
COc1cccc(c1)C(=O)CC1C(O)[C@H](O[C@@H]2OC(CO)[C@H](O)C(OCc3ccc4ccccc4c3)C2O)C(CO)O[C@H]1OCC[N-][N+]#N
: