Target
Galectin-3
Ligand
BDBM223992
Substrate
Meas. Tech.
Fluorescence Polarization Assay
Temperature
277.15±0 K
Kd
6.6e+2± 5e+1 nM
Citation
 Dion, JDeshayes, FStorozhylova, NAdvedissian, TLambert, AViguier, MTellier, CDussouy, CPoirier, FGrandjean, C Lactosamine-Based Derivatives as Tools to Delineate the Biological Functions of Galectins: Application to Skin Tissue Repair. Chembiochem 18:782-789 (2017)  
Target
Name:
Galectin-3
Synonyms:
LEG3_HUMAN MAC2
Type:
Enzyme
Mol. Mass.:
26156.54
Organism:
Homo sapiens (Human)
Description:
P17931
Residue:
250
  
Inhibitor
Name:
BDBM223992
Synonyms:
4-O-[3-O-(3-methoxybenzyl)-β-D-galactopyranosyl)]-1-azido-1,2-dideoxy-2-(3-methoxybenzamido)-β-D-glucopyranose (1)
Type:
Small organic molecule
Emp. Form.:
C28H36N4O12
Mol. Mass.:
620.605
SMILES:
COc1cccc(COC2[C@@H](O)C(CO)O[C@@H](O[C@@H]3C(CO)O[C@@H](N=[N+]=[N-])C(NC(=O)c4cccc(OC)c4)C3O)C2O)c1
: