Target
Galectin-3
Ligand
BDBM223993
Substrate
Meas. Tech.
Fluorescence Polarization Assay
Temperature
277.15±0 K
Kd
36± 23 nM
Citation
 Dion, JDeshayes, FStorozhylova, NAdvedissian, TLambert, AViguier, MTellier, CDussouy, CPoirier, FGrandjean, C Lactosamine-Based Derivatives as Tools to Delineate the Biological Functions of Galectins: Application to Skin Tissue Repair. Chembiochem 18:782-789 (2017)  
Target
Name:
Galectin-3
Synonyms:
LEG3_HUMAN MAC2
Type:
Enzyme
Mol. Mass.:
26156.54
Organism:
Homo sapiens (Human)
Description:
P17931
Residue:
250
  
Inhibitor
Name:
BDBM223993
Synonyms:
TD139
Type:
Small organic molecule
Emp. Form.:
C28H30F2N6O8S
Mol. Mass.:
648.635
SMILES:
OCC1O[C@@H](S[C@@H]2OC(CO)[C@H](O)C(C2O)n2cc(nn2)-c2cccc(F)c2)C(O)C([C@H]1O)n1cc(nn1)-c1cccc(F)c1
: