Target
Ribosomal protein S6 kinase beta-1
Ligand
BDBM224373
Substrate
Meas. Tech.
Enzyme Assay
pH
7.5±n/a
IC50
450±n/a nM
Comments
extracted
Citation
 Lan, RHuck, BRChen, XDeselm, LCQiu, HXiao, YNeagu, CMochalkin, IJohnson, TL Aminopyrimidine derivatives for use as modulators of kinase activity US Patent  US9321760 Publication Date 4/26/2016 
Target
Name:
Ribosomal protein S6 kinase beta-1
Synonyms:
70 kDa ribosomal protein S6 kinase 1 70 kDa ribosomal protein kinase (p70S6K) Protein kinase 70S6K (T412E) RPS6KB1 Ribosomal protein S6 kinase I STK14A p70S6K1
Type:
Enzyme
Mol. Mass.:
59139.89
Organism:
Homo sapiens (Human)
Description:
His-tagged S6K1.
Residue:
525
  
Inhibitor
Name:
BDBM224373
Synonyms:
US10080750, Compound 50 US9662330, Compound 50
Type:
Small organic molecule
Emp. Form.:
C28H26F2N4
Mol. Mass.:
456.5296
SMILES:
Nc1ncnc(N2CCC(Cc3ccc(cc3)-c3ccc(F)cc3)CC2)c1-c1ccc(F)cc1
: