Target
Histone-lysine N-methyltransferase EHMT2
Ligand
BDBM225246
Substrate
Meas. Tech.
Enzymatic Assay
pH
8.5±n/a
Temperature
298.15±n/a K
IC50
3.041e+4± 1.91e+3 nM
Comments
extracted
Citation
 Zhang, JYao, DJiang, YHuang, JYang, SWang, J Synthesis and biological evaluation of benzimidazole derivatives as the G9a Histone Methyltransferase inhibitors that induce autophagy and apoptosis of breast cancer cells. Bioorg Chem 72:168-181 (2017)  
Target
Name:
Histone-lysine N-methyltransferase EHMT2
Synonyms:
BAT8 EHMT2 G9A Histone-lysine N-methyltransferase EHMT1/EHMT2 KMT1C Protein G9a (G9a)
Type:
Enzyme
Mol. Mass.:
132339.87
Organism:
Homo sapiens (Human)
Description:
Q96KQ7
Residue:
1210
  
Inhibitor
Name:
BDBM225246
Synonyms:
4-Cyano-N-(2-phenylbenzo[d]oxazol-6-yl)benzenesulfonamide (7)
Type:
Small organic molecule
Emp. Form.:
C20H13N3O3S
Mol. Mass.:
375.401
SMILES:
O=S(=O)(Nc1ccc2nc(oc2c1)-c1ccccc1)c1ccc(cc1)C#N
: