Target
Histone-lysine N-methyltransferase EHMT2
Ligand
BDBM225251
Substrate
Meas. Tech.
Enzymatic Assay
pH
8.5±n/a
Temperature
298.15±n/a K
IC50
1.527e+4± 1.92e+3 nM
Comments
extracted
Citation
 Zhang, JYao, DJiang, YHuang, JYang, SWang, J Synthesis and biological evaluation of benzimidazole derivatives as the G9a Histone Methyltransferase inhibitors that induce autophagy and apoptosis of breast cancer cells. Bioorg Chem 72:168-181 (2017)  
Target
Name:
Histone-lysine N-methyltransferase EHMT2
Synonyms:
BAT8 EHMT2 G9A Histone-lysine N-methyltransferase EHMT1/EHMT2 KMT1C Protein G9a (G9a)
Type:
Enzyme
Mol. Mass.:
132339.87
Organism:
Homo sapiens (Human)
Description:
Q96KQ7
Residue:
1210
  
Inhibitor
Name:
BDBM225251
Synonyms:
3-Bromo-N-(2-phenylbenzo[d]oxazol-6-yl)benzamide (12)
Type:
Small organic molecule
Emp. Form.:
C20H13BrN2O2
Mol. Mass.:
393.233
SMILES:
Brc1cccc(c1)C(=O)Nc1ccc2nc(oc2c1)-c1ccccc1
: