Target
Histone-lysine N-methyltransferase EHMT2
Ligand
BDBM225252
Substrate
Meas. Tech.
Enzymatic Assay
pH
8.5±n/a
Temperature
298.15±n/a K
IC50
3.538e+4± 1.24e+3 nM
Comments
extracted
Citation
 Zhang, JYao, DJiang, YHuang, JYang, SWang, J Synthesis and biological evaluation of benzimidazole derivatives as the G9a Histone Methyltransferase inhibitors that induce autophagy and apoptosis of breast cancer cells. Bioorg Chem 72:168-181 (2017)  
Target
Name:
Histone-lysine N-methyltransferase EHMT2
Synonyms:
BAT8 EHMT2 G9A Histone-lysine N-methyltransferase EHMT1/EHMT2 KMT1C Protein G9a (G9a)
Type:
Enzyme
Mol. Mass.:
132339.87
Organism:
Homo sapiens (Human)
Description:
Q96KQ7
Residue:
1210
  
Inhibitor
Name:
BDBM225252
Synonyms:
3-Nitro-N-(2-phenyl-1-(3-phenylpropyl)-1H-benzo[d]imidazol-5-yl)benzenesulfonamide (13)
Type:
Small organic molecule
Emp. Form.:
C28H24N4O4S
Mol. Mass.:
512.58
SMILES:
[O-][N+](=O)c1cccc(c1)S(=O)(=O)Nc1ccc2n(CCCc3ccccc3)c(nc2c1)-c1ccccc1
: