Target
Histone-lysine N-methyltransferase EHMT2
Ligand
BDBM225257
Substrate
Meas. Tech.
Enzymatic Assay
pH
8.5±n/a
Temperature
298.15±n/a K
IC50
1.876e+4± 5.8e+2 nM
Comments
extracted
Citation
 Zhang, JYao, DJiang, YHuang, JYang, SWang, J Synthesis and biological evaluation of benzimidazole derivatives as the G9a Histone Methyltransferase inhibitors that induce autophagy and apoptosis of breast cancer cells. Bioorg Chem 72:168-181 (2017)  
Target
Name:
Histone-lysine N-methyltransferase EHMT2
Synonyms:
BAT8 EHMT2 G9A Histone-lysine N-methyltransferase EHMT1/EHMT2 KMT1C Protein G9a (G9a)
Type:
Enzyme
Mol. Mass.:
132339.87
Organism:
Homo sapiens (Human)
Description:
Q96KQ7
Residue:
1210
  
Inhibitor
Name:
BDBM225257
Synonyms:
4-Cyano-N-(2-phenyl-1-(3-phenylpropyl)-1H-benzo[d]imidazol-5-yl)benzenesulfonamide (18)
Type:
Small organic molecule
Emp. Form.:
C29H24N4O2S
Mol. Mass.:
492.591
SMILES:
O=S(=O)(Nc1ccc2n(CCCc3ccccc3)c(nc2c1)-c1ccccc1)c1ccc(cc1)C#N
: