Target
Lysine-specific histone demethylase 1A
Ligand
BDBM225265
Substrate
Meas. Tech.
LSD1 Screening Assay
pH
7.5±n/a
Temperature
298.15±n/a K
IC50
1.3e+4±n/a nM
Comments
extracted
Citation
 Xi, JXu, SWu, LMa, TLiu, RLiu, YCDeng, DGu, YZhou, JLan, FZha, X Design, synthesis and biological activity of 3-oxoamino-benzenesulfonamides as selective and reversible LSD1 inhibitors. Bioorg Chem 72:182-189 (2017)  
Target
Name:
Lysine-specific histone demethylase 1A
Synonyms:
AOF2 Flavin-containing amine oxidase domain-containing protein 2 KDM1A KIAA0601 Lysine-specific demethylase 1 (LSD1) Lysine-specific histone demethylase 1 (LSD1)
Type:
Enzyme
Mol. Mass.:
92901.01
Organism:
Homo sapiens (Human)
Description:
O60341
Residue:
852
  
Inhibitor
Name:
BDBM225265
Synonyms:
2-((5-Chloro-2-hydroxyphenyl)amino)-N-(3-(morpholinosulfonyl)phenyl)acetamide (7a)
Type:
Small organic molecule
Emp. Form.:
C18H20ClN3O5S
Mol. Mass.:
425.887
SMILES:
Oc1ccc(Cl)cc1NCC(=O)Nc1cccc(c1)S(=O)(=O)N1CCOCC1
: