Target
Lysine-specific histone demethylase 1A
Ligand
BDBM225271
Substrate
Meas. Tech.
LSD1 Screening Assay
pH
7.5±n/a
Temperature
298.15±n/a K
IC50
1.1e+4±n/a nM
Comments
extracted
Citation
 Xi, JXu, SWu, LMa, TLiu, RLiu, YCDeng, DGu, YZhou, JLan, FZha, X Design, synthesis and biological activity of 3-oxoamino-benzenesulfonamides as selective and reversible LSD1 inhibitors. Bioorg Chem 72:182-189 (2017)  
Target
Name:
Lysine-specific histone demethylase 1A
Synonyms:
AOF2 Flavin-containing amine oxidase domain-containing protein 2 KDM1A KIAA0601 Lysine-specific demethylase 1 (LSD1) Lysine-specific histone demethylase 1 (LSD1)
Type:
Enzyme
Mol. Mass.:
92901.01
Organism:
Homo sapiens (Human)
Description:
O60341
Residue:
852
  
Inhibitor
Name:
BDBM225271
Synonyms:
2-((5-Chloro-2-hydroxyphenyl)(methyl)amino)-N-(3-(piperidin-1-ylsulfonyl)phenyl)acetamide (7g)
Type:
Small organic molecule
Emp. Form.:
C20H24ClN3O4S
Mol. Mass.:
437.94
SMILES:
CN(CC(=O)Nc1cccc(c1)S(=O)(=O)N1CCCCC1)c1cc(Cl)ccc1O
: