Target
Heat shock protein HSP 90-beta
Ligand
BDBM225868
Substrate
Meas. Tech.
FRET Assay
IC50
2770±n/a nM
Citation
 D3R, DD AbbVie-CSAR HSP90 D3R 408:0 (2016) Target
Name:
Heat shock protein HSP 90-beta
Synonyms:
HS90B_HUMAN HSP 90 HSP90B HSPCB Heat shock protein HSP 90 (Hsp90)
Type:
Molecular Chaperone
Mol. Mass.:
83229.45
Organism:
Homo sapiens (Human)
Description:
P08238
Residue:
724
  
Inhibitor
Name:
BDBM225868
Synonyms:
hsp90_164
Type:
Small Organic Molecule
Emp. Form.:
C13H9ClO3
Mol. Mass.:
248.662
SMILES:
Oc1ccc(cc1)C(=O)c1cc(Cl)ccc1O
: