Target
Mitogen-activated protein kinase kinase kinase kinase 4
Ligand
BDBM225895
Substrate
Meas. Tech.
Z'Lyte Assay
Ki
75.5±n/a nM
IC50
88.4±n/a nM
Citation
 D3R, DD Genentech MAP4K4 D3R 409:0 (2016) Target
Name:
Mitogen-activated protein kinase kinase kinase kinase 4
Synonyms:
HGK KIAA0687 MAP4K4 MAPK/ERK kinase kinase kinase 4 MEKKK 4 NIK | Nck-interacting kinase
Type:
Serine/threonine-protein kinase
Mol. Mass.:
142114.73
Organism:
Homo sapiens (Human)
Description:
O95819
Residue:
1239
  
Inhibitor
Name:
BDBM225895
Synonyms:
MAP14 US9855269, Compound 38
Type:
Small Organic Molecule
Emp. Form.:
C19H20FN5O
Mol. Mass.:
353.3934
SMILES:
CN(C)CCC(=O)Nc1cc(F)cc(c1)-c1ccc2ncnc(N)c2c1
: