Target
RNA polymerase sigma factor SigB
Ligand
BDBM226119
Substrate
Meas. Tech.
Biolayer Interferometry (BLI) Assay
Kd
11700±5800 nM
Citation
 Vishwanath, SBanerjee, SJamithireddy, AKSrinivasan, NGopal, BChatterjee, J Design, Synthesis, and Experimental Validation of Peptide Ligands Targeting Mycobacterium tuberculosis s Factors. Biochemistry 56:2209-2218 (2017)  
Target
Name:
RNA polymerase sigma factor SigB
Synonyms:
RNA polymerase sigma factor SigB (σB) SIGB_MYCTU sigB
Type:
Protein
Mol. Mass.:
36343.42
Organism:
Mycobacterium tuberculosis
Description:
P9WGI5
Residue:
323
  
Inhibitor
Name:
BDBM226119
Synonyms:
ELTPRESDDRHDSGRD | MT6
Type:
Small organic molecule
Emp. Form.:
C73H117N27O32
Mol. Mass.:
1884.8718
SMILES:
CC(C)C[C@H](NC(=O)[C@@H](N)CCC(O)=O)C(=O)N[C@@H]([C@@H](C)O)C(=O)N1CCC[C@H]1C(=O)N[C@@H](CCCNC(N)=N)C(=O)N[C@@H](CCC(O)=O)C(=O)N[C@@H](CO)C(=O)N[C@@H](CC(O)=O)C(=O)N[C@@H](CC(O)=O)C(=O)N[C@@H](CCCNC(N)=N)C(=O)N[C@@H](Cc1cnc[nH]1)C(=O)N[C@@H](CC(O)=O)C(=O)N[C@@H](CO)C(=O)NCC(=O)N[C@@H](CCCNC(N)=N)C(=O)N[C@@H](CC(O)=O)C(O)=O
: