Target
Proto-oncogene tyrosine-protein kinase Src
Ligand
BDBM6200
Substrate
poly(E,Y)
Meas. Tech.
In Vitro Src Kinase Inhibition Test
pH
7.4±n/a
Temperature
295.15±n/a K
IC50
10±n/a nM
Citation
 Ple, PAGreen, TPHennequin, LFCurwen, JFennell, MAllen, JLambert-Van Der Brempt, CCostello, G Discovery of a new class of anilinoquinazoline inhibitors with high affinity and specificity for the tyrosine kinase domain of c-Src. J Med Chem 47:871-87 (2004)  
Target
Name:
Proto-oncogene tyrosine-protein kinase Src
Synonyms:
Calmodulin/Proto-oncogene tyrosine-protein kinase Src Proto-oncogene c-Src SRC SRC_HUMAN V-src sarcoma (Schmidt-Ruppin A-2) viral oncogene homolog (avian) p60-Src | pp60c-src
Type:
Protein
Mol. Mass.:
59838.60
Organism:
Homo sapiens (Human)
Description:
P12931
Residue:
536
  
Inhibitor
Name:
BDBM6200
Synonyms:
Benzofuran deriv. 9 N-(5-chloro-1-benzofuran-4-yl)-6-methoxy-7-[3-(morpholin-4-yl)propoxy]quinazolin-4-amine dihydrochloride
Type:
Small organic molecule
Emp. Form.:
C24H25ClN4O4
Mol. Mass.:
468.933
SMILES:
COc1cc2c(Nc3c(Cl)ccc4occc34)ncnc2cc1OCCCN1CCOCC1
:
Substrate
Name:
poly(E,Y)
Synonyms:
Type:
Random Copolymer
Mol. Mass.:
358.43
Organism:
Description:
A poly(Glu,Tyr) 4:1 random copolymer. 10 uM ATP was used as co-substrate
Residue:
3
NA