Target
Genome polyprotein [1028-1200,1251-1711]
Ligand
BDBM229537
Substrate
EC50
3±2 nM
Citation
 Gillis, EPBowsher, MSScola, PM Hepatitis C virus inhibitors US Patent  US9334279 Publication Date 5/10/2016 
Target
Name:
Genome polyprotein [1028-1200,1251-1711]
Synonyms:
NS3/4A protease | POLG_HCVJ4
Type:
Mol. Mass.:
67564.11
Organism:
Hepatitis C virus genotype 1b (strain J4L2S) (HCV)
Description:
amino acids 1027 to 1711
Residue:
634
  
Inhibitor
Name:
BDBM229537
Synonyms:
US9334279, 1013
Type:
Small organic molecule
Emp. Form.:
C46H58F3N7O9S
Mol. Mass.:
942.054
SMILES:
CC(C)Oc1ccc(cc1)-c1cc(O[C@@H]2C[C@@H]3N(C2)C(=O)[C@@H](NC(=O)OC(C)(C)C(F)(F)F)[C@H](C)C[C@H](C)CC\C=C/[C@@H]2C[C@]2(NC3=O)C(=O)NS(=O)(=O)C2(C)CC2)cc(n1)-n1cccn1
: