Target
Genome polyprotein [1027-1711]
Ligand
BDBM229544
Substrate
Meas. Tech.
Reporter Assay
Temperature
310.15±n/a K
EC50
20±15 nM
Comments
extracted
Citation
 Gillis, EPBowsher, MSScola, PM Hepatitis C virus inhibitors US Patent  US9334279 Publication Date 5/10/2016 
Target
Name:
Genome polyprotein [1027-1711]
Synonyms:
NS3-NS4A Protease POLG_HCV77
Type:
Mol. Mass.:
72913.15
Organism:
Hepatitis C virus genotype 1a (strain H77) (HCV)
Description:
amino acids 1027 to 1711
Residue:
685
  
Inhibitor
Name:
BDBM229544
Synonyms:
US9334279, 1020
Type:
Small organic molecule
Emp. Form.:
C47H58F3N7O9S
Mol. Mass.:
954.065
SMILES:
CC(C)Oc1ccc(cc1)-c1cc(O[C@@H]2C[C@@H]3N(C2)C(=O)[C@@H](NC(=O)OC(C)(C)C(F)(F)F)[C@H](C)C[C@@H](C)CC\C=C/[C@@H]2C[C@]2(NC3=O)C(=O)NS(=O)(=O)C2(C)CC2)cc(n1)-c1ncccn1
: