Target
Genome polyprotein [1028-1200,1251-1711]
Ligand
BDBM229557
Substrate
EC50
0.75±0.25 nM
Citation
 Gillis, EPBowsher, MSScola, PM Hepatitis C virus inhibitors US Patent  US9334279 Publication Date 5/10/2016 
Target
Name:
Genome polyprotein [1028-1200,1251-1711]
Synonyms:
NS3/4A protease | POLG_HCVJ4
Type:
Mol. Mass.:
67564.11
Organism:
Hepatitis C virus genotype 1b (strain J4L2S) (HCV)
Description:
amino acids 1027 to 1711
Residue:
634
  
Inhibitor
Name:
BDBM229557
Synonyms:
US9334279, 1033
Type:
Small organic molecule
Emp. Form.:
C46H57F3N6O10S2
Mol. Mass.:
975.104
SMILES:
CC[C@@H]1O[C@H](C)CC\C=C/[C@@H]2C[C@]2(NC(=O)[C@@H]2C[C@H](CN2C(=O)[C@H]1NC(=O)OC(C)(C)C(F)(F)F)Oc1cc(nc(c1)-c1ccc(OC(C)C)cc1)-c1cncs1)C(=O)NS(=O)(=O)C1(C)CC1
: