Target
Membrane primary amine oxidase
Ligand
BDBM291383
Substrate
Meas. Tech.
Biological Assay
IC50
<100±n/a nM
Citation
 Patient, LEvans, DSimpson, IPowell, A Compounds US Patent  US9580415 Publication Date 2/28/2017 
Target
Name:
Membrane primary amine oxidase
Synonyms:
AOC3 Amine oxidase, copper containing Semicarbazide-sensitive amine oxidase/ Vascular adhesion protein 1 (SSAO/VAP-1) Vascular adhesion protein 1 (VAP-1)
Type:
Protein
Mol. Mass.:
84620.86
Organism:
Homo sapiens (Human)
Description:
Q16853
Residue:
763
  
Inhibitor
Name:
BDBM291383
Synonyms:
4-[1-(4-Chlorophenyl)-3-(piperidin-4-yl)-1H-pyrrolo[2,3-c]pyridin-2-yl]pyridine | US9580415, Example 17
Type:
Small organic molecule
Emp. Form.:
C23H21ClN4
Mol. Mass.:
388.893
SMILES:
Clc1ccc(cc1)-n1c(c(C2CCNCC2)c2ccncc12)-c1ccncc1
: