Target
Potassium voltage-gated channel subfamily H member 2
Ligand
BDBM291383
Substrate
Meas. Tech.
hERG Assay
pH
7.3±n/a
Temperature
298.15±n/a K
IC50
5500±n/a nM
Comments
extracted
Citation
 Patient, LEvans, DSimpson, IPowell, A Compounds US Patent  US9580415 Publication Date 2/28/2017 
Target
Name:
Potassium voltage-gated channel subfamily H member 2
Synonyms:
1,3-beta-glucan synthase component GLS2 ERG Eag-related protein 1 Ether-a-go-go-related gene (HERG) Ether-a-go-go-related gene potassium channel 1 Ether-a-go-go-related gene potassium channel 1 (hERG1) Ether-a-go-go-related protein 1 H-ERG KCNH2 Potassium voltage-gated channel subfamily H member 2 (hERG) Voltage-gated potassium channel subunit Kv11.1 hERG Potassium Channel 1 | putative potassium channel subunit
Type:
Multi-pass membrane protein
Mol. Mass.:
126672.65
Organism:
Homo sapiens (Human)
Description:
Q12809
Residue:
1159
  
Inhibitor
Name:
BDBM291383
Synonyms:
4-[1-(4-Chlorophenyl)-3-(piperidin-4-yl)-1H-pyrrolo[2,3-c]pyridin-2-yl]pyridine | US9580415, Example 17
Type:
Small organic molecule
Emp. Form.:
C23H21ClN4
Mol. Mass.:
388.893
SMILES:
Clc1ccc(cc1)-n1c(c(C2CCNCC2)c2ccncc12)-c1ccncc1
: