Target
Vascular endothelial growth factor receptor 2
Ligand
BDBM228553
Substrate
Meas. Tech.
FLIPR (Fluorometric Imaging Plate Reader) Assay
Temperature
310.15±n/a K
IC50
4±n/a nM
Comments
extracted
Citation
 Guo, XZhu, Z Compounds as tyrosine kinase modulators US Patent  US9340555 Publication Date 5/17/2016 
Target
Name:
Vascular endothelial growth factor receptor 2
Synonyms:
CD_antigen=CD309 Fetal liver kinase 1 (FLK-1) KDR Protein-tyrosine kinase receptor Flk-1 VEGFR-2 VEGFR2 Vascular Endothelial Growth Factor Receptor Kinase 2 Vascular endothelial growth factor receptor 2 (KDR) Vascular endothelial growth factor receptor 2 (VEGFR2) Vascular endothelial growth factor receptor-2 (VEGFR-2)
Type:
Receptor Tyrosine Kinase
Mol. Mass.:
151510.97
Organism:
Homo sapiens (Human)
Description:
P35968
Residue:
1356
  
Inhibitor
Name:
BDBM228553
Synonyms:
US9340555, 42
Type:
Small organic molecule
Emp. Form.:
C31H31F2N5O5S
Mol. Mass.:
623.67
SMILES:
COC(=O)C1CCCN1CCCNC(=O)c1cc2nccc(Oc3ccc(NC(=O)Nc4cc(C)ccc4F)c(F)c3)c2s1
: