Target
Vascular endothelial growth factor receptor 2
Ligand
BDBM228543
Substrate
Meas. Tech.
Kinase Assay
pH
7.2±n/a
Temperature
298.15±n/a K
IC50
5±n/a nM
Comments
extracted
Citation
 Guo, XZhu, Z Compounds as tyrosine kinase modulators US Patent  US9340555 Publication Date 5/17/2016 
Target
Name:
Vascular endothelial growth factor receptor 2
Synonyms:
CD_antigen=CD309 Fetal liver kinase 1 (FLK-1) KDR Protein-tyrosine kinase receptor Flk-1 VEGFR-2 VEGFR2 Vascular Endothelial Growth Factor Receptor Kinase 2 Vascular endothelial growth factor receptor 2 (KDR) Vascular endothelial growth factor receptor 2 (VEGFR2) Vascular endothelial growth factor receptor-2 (VEGFR-2)
Type:
Receptor Tyrosine Kinase
Mol. Mass.:
151510.97
Organism:
Homo sapiens (Human)
Description:
P35968
Residue:
1356
  
Inhibitor
Name:
BDBM228543
Synonyms:
US9340555, 29
Type:
Small organic molecule
Emp. Form.:
C36H39F2N7O6S
Mol. Mass.:
735.8
SMILES:
CCOC(=O)CN1CCN(CC1)C(=O)CN1CCN(CC1)C(=O)c1cc2nccc(Oc3ccc(NC(=O)Nc4cc(C)ccc4F)c(F)c3)c2s1
: