Target
Vascular endothelial growth factor receptor 1
Ligand
BDBM228529
Substrate
Meas. Tech.
Kinase Assay
pH
7.2±n/a
Temperature
298.15±n/a K
IC50
4±n/a nM
Comments
extracted
Citation
 Guo, XZhu, Z Compounds as tyrosine kinase modulators US Patent  US9340555 Publication Date 5/17/2016 
Target
Name:
Vascular endothelial growth factor receptor 1
Synonyms:
FLT FRT Fms-like tyrosine kinase 1 Tyrosine-protein kinase FRT VEGFR-1 VGFR1_HUMAN Vascular endothelial growth factor receptor 1 (FLT1) Vascular endothelial growth factor receptor 1 and 2 (Flt-1 and KDR) Vascular permeability factor receptor vascular endothelial growth factor/vascular permeability factor receptor
Type:
Receptor Tyrosine Kinase
Mol. Mass.:
150800.23
Organism:
Homo sapiens (Human)
Description:
P17948
Residue:
1338
  
Inhibitor
Name:
BDBM228529
Synonyms:
US9340555, 12
Type:
Small organic molecule
Emp. Form.:
C26H23FN8O3S
Mol. Mass.:
546.576
SMILES:
Cc1ccc(F)c(NC(=O)Nc2ccc(Oc3ccnc4cc(sc34)C(=O)NCCCc3nn[nH]n3)cc2)c1
: