Target
Vascular endothelial growth factor receptor 1
Ligand
BDBM228572
Substrate
Meas. Tech.
Kinase Assay
pH
7.2±n/a
Temperature
298.15±n/a K
IC50
5±n/a nM
Comments
extracted
Citation
 Guo, XZhu, Z Compounds as tyrosine kinase modulators US Patent  US9340555 Publication Date 5/17/2016 
Target
Name:
Vascular endothelial growth factor receptor 1
Synonyms:
FLT FRT Fms-like tyrosine kinase 1 Tyrosine-protein kinase FRT VEGFR-1 VGFR1_HUMAN Vascular endothelial growth factor receptor 1 (FLT1) Vascular endothelial growth factor receptor 1 and 2 (Flt-1 and KDR) Vascular permeability factor receptor vascular endothelial growth factor/vascular permeability factor receptor
Type:
Receptor Tyrosine Kinase
Mol. Mass.:
150800.23
Organism:
Homo sapiens (Human)
Description:
P17948
Residue:
1338
  
Inhibitor
Name:
BDBM228572
Synonyms:
US9340555, 69
Type:
Small organic molecule
Emp. Form.:
C28H30FN5O3S
Mol. Mass.:
535.633
SMILES:
CCN(CC)CCNC(=O)c1cc2nccc(Oc3ccc(NC(=O)Nc4cc(C)ccc4F)cc3)c2s1
: