Target
Tumor necrosis factor
Ligand
BDBM228654
Substrate
Meas. Tech.
Surface Plasmon Resonance (SPR) Assay
pH
7±n/a
Kd
110±0.0 nM
Comments
extracted
Citation
 Ma, LGong, HZhu, HJi, QSu, PLiu, PCao, SYao, JJiang, LHan, MMa, XXiong, DLuo, HRWang, FZhou, JXu, Y A novel small-molecule tumor necrosis factor a inhibitor attenuates inflammation in a hepatitis mouse model. J Biol Chem 289:12457-66 (2014)  
Target
Name:
Tumor necrosis factor
Synonyms:
Cachectin TNF-a TNFA TNFSF2 Tumor necrosis factor (TNFa) Tumor necrosis factor ligand superfamily member 2 Tumor necrosis factor, soluble form | tumor necrosis factor alpha
Type:
Enzyme
Mol. Mass.:
25645.11
Organism:
Homo sapiens (Human)
Description:
P01375
Residue:
233
  
Inhibitor
Name:
BDBM228654
Synonyms:
(E)-4-(2-(4-chloro-3-nitrophenyl)) (C87)
Type:
Small organic molecule
Emp. Form.:
C24H15ClN6O3S
Mol. Mass.:
502.932
SMILES:
[O-][N+](=O)c1cc(N\N=C2\C(=O)N(N=C2c2ccccc2)c2nc(cs2)-c2ccccc2)ccc1Cl
: