Target
DNA-directed RNA polymerase subunit beta
Ligand
BDBM228835
Substrate
Meas. Tech.
RNAP-Inhibition Assay
Temperature
310.15±n/a K
IC50
2e+3±n/a nM
Comments
extracted
Citation
 Walker, SSDegen, DNickbarg, ECarr, DSoriano, AMandal, MPainter, RESheth, PXiao, LSher, XMurgolo, NSu, JOlsen, DBEbright, RHYoung, K Affinity Selection-Mass Spectrometry Identifies a Novel Antibacterial RNA Polymerase Inhibitor. ACS Chem Biol 12:1346-1352 (2017)  
Target
Name:
DNA-directed RNA polymerase subunit beta
Synonyms:
Bacterial DNA-directed RNA polymerase DNA-directed RNA polymerase subunit beta RNA polymerase subunit beta (β-RNAP) RPOB_ECOLI groN rif rpoB stv | tabD
Type:
Enzyme
Mol. Mass.:
150595.80
Organism:
Escherichia coli
Description:
P0A8V2
Residue:
1342
  
Inhibitor
Name:
BDBM228835
Synonyms:
MRL-436
Type:
Small organic molecule
Emp. Form.:
C24H22N4O
Mol. Mass.:
382.4577
SMILES:
CC(C)Cc1nnc2c(cccn12)C(=O)NC1c2ccccc2-c2ccccc12
: